{"text_format":"1","workbook":"xlsx","n_sheets":8,"sheets":["Running Totals","Donation Averages","Income Source Analytics","Donations by Class","Fund Drive Budget History","Tables","Sanitized Raw Data","Sheet11"],"not_rendered":{"charts":10,"images":0,"macros":1,"external_links":0,"defined_names":1,"comments":0,"pivot_tables":1},"unopened":[],"bounds":{"document_bytes":16777216,"sheet_cells":100000,"rows_first":2000,"rows_last":500,"rows_between":2000,"halvings":0,"cell_chars":16384,"cell_head_chars":4096},"cells_cut":0,"cells_raw":0,"read":"whole","date_system":"1900"}

{"sheet":"Running Totals","index":0,"n_rows":0,"n_cols":0,"rows_kept":0,"cut":false,"hidden":false,"merged":[]}

{"sheet":"Donation Averages","index":1,"n_rows":0,"n_cols":0,"rows_kept":0,"cut":false,"hidden":false,"merged":[]}

{"sheet":"Income Source Analytics","index":2,"n_rows":0,"n_cols":0,"rows_kept":0,"cut":false,"hidden":false,"merged":[]}

{"sheet":"Donations by Class","index":3,"n_rows":90,"n_cols":4,"rows_kept":90,"cut":false,"hidden":false,"merged":[]}
[]
[]
[]
[]
[]
[]
{"$rows_left_out":85}
{"sheet":"Fund Drive Budget History","index":4,"n_rows":50,"n_cols":3,"rows_kept":50,"cut":false,"hidden":false,"merged":[]}
[8,"Fall 2000",68617]
[9,"Spring 2001",102827]
[10,"Fall 2001",95623]
[11,"Spring 2002",111701]
[12,"Fall 2002",106844]
[13,"Spring 2003",102871]
{"$rows_left_out":45}
{"sheet":"Tables","index":5,"n_rows":47,"n_cols":204,"rows_kept":47,"cut":false,"hidden":false,"merged":[[0,164,0,203],[0,0,0,39],[0,41,0,80],[0,82,0,121],[0,123,0,162]]}
["FD57",null,null,null,null,null,null,null,null,null,null,null,null,null,null,null,null,null,null,null,null,null,null,null,null,null,null,null,null,null,null,null,null,null,null,null,null,null,null,null,null,"FD 56",null,null,null,null,null,null,null,null,null,null,null,null,null,null,null,null,null,null,null,null,null,null,null,null,null,null,null,null,null,null,null,null,null,null,null,null,null,null,null,null,"FD 55",null,null,null,null,null,null,null,null,null,null,null,null,null,null,null,null,null,null,null,null,null,null,null,null,null,null,null,null,null,null,null,null,null,null,null,null,null,null,null,null,"FD 54",null,null,null,null,null,null,null,null,null,null,null,null,null,null,null,null,null,null,null,null,null,null,null,null,null,null,null,null,null,null,null,null,null,null,null,null,null,null,null,null,"FD 53"]
["Day","Date","Goal","Matching Grant #","Matching Grant Amt","Cash #","Cash Amt","Credit Card #","Credit Card Amt","PayPal #","PayPal Amt","Check #","Check Amt","Operating Budget","Donations by Day","Total Donations","Avg Overall Donation Amt","Avg Donation/Day","Average Donated Daily","Daily % of Goal","Daily % Matching $","Daily % Matching #","Overall %Matching $","Overall % Matching #","Daily % Cash $","Daily % Cash #","Overall % Cash $","Overall % Cash #","Daily % CC $","Daily % CC #","Overall % CC $","Overall % CC #","Daily % PP $","Daily % PP #","Overall % PP $","Overall % PP #","Daily % Chk $","Daily % Chk #","Overall % Chk $","Overall % Chk #",null,"Day","Date","Goal","Matching Grant #","Matching Grant Amt","Cash #","Cash Amt","Credit Card #","Credit Card Amt","PayPal #","PayPal Amt","Check #","Check Amt","Operating Budget","Donations by Day","Total Donations","Avg Overall Donation Amt","Avg Donation/Day","Average Donated  Daily","Daily % of Goal","Daily % Matching $","Daily % Matching #","Overall %Matching $","Overall % Matching #","Daily % Cash $","Daily % Cash #","Overall % Cash $","Overall % Cash #","Daily % CC $","Daily % CC #","Overall % CC $","Overall % CC #","Daily % PP $","Daily % PP #","Overall % PP $","Overall % PP #","Daily % Chk $","Daily % Chk #","Overall % Chk $","Overall % Chk #",null,"Day","Date","Goal","Matching Grant #","Matching Grant Amt","Cash #","Cash Amt","Credit Card #","Credit Card Amt","PayPal #","PayPal Amt","Check #","Check Amt","Operating Budget","Donations by Day","Total Donations","Avg Overall Donation Amt","Avg Donation/Day","Average Donated Daily","Daily % of Goal","Daily % Matching $","Daily % Matching #","Overall %Matching $","Overall % Matching #","Daily % Cash $","Daily % Cash #","Overall % Cash $","Overall % Cash #","Daily % CC $","Daily % CC #","Overall % CC $","Overall % CC #","Daily % PP $","Daily % PP #","Overall % PP $","Overall % PP #","Daily % Chk $","Daily % Chk #","Overall % Chk $","Overall % Chk #",null,"Day","Date","Goal","Matching Grant #","Matching Grant Amt","Cash #","Cash Amt","Credit Card #","Credit Card Amt","PayPal #","PayPal Amt","Check #","Check Amt","Operating Budget","Donations by Day","Total Donations","Avg Overall Donation Amt","Avg Donation/Day","Average Donated Daily","Daily % of Goal","Daily % Matching $","Daily % Matching #","Overall %Matching $","Overall % Matching #","Daily % Cash $","Daily % Cash #","Overall % Cash $","Overall % Cash #","Daily % CC $","Daily % CC #","Overall % CC $","Overall % CC #","Daily % PP $","Daily % PP #","Overall % PP $","Overall % PP #","Daily % Chk $","Daily % Chk #","Overall % Chk $","Overall % Chk #",null,"Day","Date","Goal","Matching Grant #","Matching Grant Amt","Cash #","Cash Amt","Credit Card #","Credit Card Amt","PayPal #","PayPal Amt","Check #","Check Amt","Operating Budget","Donations by Day","Total Donations","Avg Overall Donation Amt","Avg Donation/Day","Average Donated Daily","Daily % of Goal","Daily % Matching $","Daily % Matching #","Overall %Matching $","Overall % Matching #","Daily % Cash $","Daily % Cash #","Overall % Cash $","Overall % Cash #","Daily % CC $","Daily % CC #","Overall % CC $","Overall % CC #","Daily % PP $","Daily % PP #","Overall % PP $","Overall % PP #","Daily % Chk $","Daily % Chk #","Overall % Chk $","Overall % Chk #"]
["Pre-Fund Drive",null,40092,{"$f":"COUNTIFS('Sanitized Raw Data'!$H:$H,\"<\"&B4,'Sanitized Raw Data'!$D:$D,\"Matching Grant\")","v":0},{"$f":"SUMIFS('Sanitized Raw Data'!$C:$C,'Sanitized Raw Data'!$H:$H,\"<\"&B4,'Sanitized Raw Data'!$D:$D,\"Matching Grant\")","v":0},{"$f":"COUNTIFS('Sanitized Raw Data'!$H:$H,\"<\"&B4,'Sanitized Raw Data'!$D:$D,\"Cash\")","v":0},{"$f":"SUMIFS('Sanitized Raw Data'!$C:$C,'Sanitized Raw Data'!$H:$H,\"<\"&B4,'Sanitized Raw Data'!$D:$D,\"Cash\")","v":0},{"$f":"COUNTIFS('Sanitized Raw Data'!$H:$H,\"<\"&B4,'Sanitized Raw Data'!$D:$D,\"CC\")","v":0},{"$f":"SUMIFS('Sanitized Raw Data'!$C:$C,'Sanitized Raw Data'!$H:$H,\"<\"&B4,'Sanitized Raw Data'!$D:$D,\"CC\")","v":0},{"$f":"COUNTIFS('Sanitized Raw Data'!$H:$H,\"<\"&B4,'Sanitized Raw Data'!$D:$D,\"PayPal\")","v":64},{"$f":"SUMIFS('Sanitized Raw Data'!$C:$C,'Sanitized Raw Data'!$H:$H,\"<\"&B4,'Sanitized Raw Data'!$D:$D,\"PayPal\")","v":3196.5400000000009},{"$f":"COUNTIFS('Sanitized Raw Data'!$H:$H,\"<\"&B4,'Sanitized Raw Data'!$D:$D,\"Personal Check\")+COUNTIFS('Sanitized Raw Data'!$H:$H,\"<\"&B4,'Sanitized Raw Data'!$D:$D,\"ACH Grant Deposit\")","v":33},{"$f":"SUMIFS('Sanitized Raw Data'!$C:$C,'Sanitized Raw Data'!$H:$H,\"<\"&B4,'Sanitized Raw Data'!$D:$D,\"Personal Check\")+SUMIFS('Sanitized Raw Data'!$C:$C,'Sanitized Raw Data'!$H:$H,\"<\"&B4,'Sanitized Raw Data'!$D:$D,\"ACH Grant Deposit\")","v":5016.1000000000004},{"$f":"SUM(G3,M3,K3,I3,E3)","v":8212.6400000000012},{"$f":"SUM(F3,H3,J3,L3)","v":97},{"$f":"SUM(F3,L3,J3,H3,D3)","v":97},{"$f":"N3/P3","v":84.666391752577326},{"$f":"(SUM(G3,M3,K3,I3,E3))/(SUM(F3,H3,J3,L3,D3))","v":84.666391752577326},null,{"$f":"(N3/C$3)","v":0.20484485682929265},{"$f":"E3/N3","v":0},{"$f":"D3/O3","v":0},{"$f":"E3/N3","v":0},{"$f":"D3/O3","v":0},{"$f":"G3/N3","v":0},{"$f":"F3/O3","v":0},{"$f":"B3/J3","v":0},{"$f":"F3/O3","v":0},{"$f":"I3/N3","v":0},{"$f":"H3/O3","v":0},{"$f":"H3/N3","v":0},{"$f":"H3/P3","v":0},{"$f":"K3/N3","v":0.38922197977751372},{"$f":"J3/O3","v":0.65979381443298968},{"$f":"K3/N3","v":0.38922197977751372},{"$f":"J3/P3","v":0.65979381443298968},{"$f":"M3/N3","v":0.61077802022248628},{"$f":"L3/O3","v":0.34020618556701032},{"$f":"M3/N3","v":0.61077802022248628},{"$f":"L3/P3","v":0.34020618556701032},null,"Pre-Fund Drive",null,40465,0,0,0,0,0,0,59,802.54,41,3337.58,4140.12,100,100,41.401199999999996,41.401199999999996,null,0.10231360434943779,0,0,0,0,0,0,0,0,0,0,0,0,0.1938446228611731,0.59,0.1938446228611731,0.59,0.8061553771388269,0.41,0.8061553771388269,0.41,null,"Pre-Fund Drive",null,39822,0,0,0,0,0,0,78,1229.5400000000002,41,5576.58,6806.12,119,119,57.194285714285712,57.194285714285712,null,0.17091356536587815,0,0,0,0,0,0,0,0,0,0,0,0,0.18065211897527522,0.65546218487394958,0.18065211897527522,0.65546218487394958,0.81934788102472478,0.34453781512605042,0.81934788102472478,0.34453781512605042,null,"Pre-Fund Drive",null,48752,1,50,0,0,1,19.63,96,2408.13,36,3986.0099999999998,6463.7699999999995,133,134,48.2370895522388,48.2370895522388,null,0.13258471447325237,7.7354237542486817E-3,7.5187969924812026E-3,7.7354237542486817E-3,7.5187969924812026E-3,0,0,0,0,3.0369273659180324E-3,7.5187969924812026E-3,1.5470847508497365E-4,7.462686567164179E-3,0.37255812010637757,0.72180451127819545,0.37255812010637757,0.71641791044776115,0.61666952877345571,0.27067669172932329,0.61666952877345571,0.26865671641791045,null,"Pre-Fund Drive",null,50252,3,250,0,0,0,0,67,1235.3300000000002,33,2932.45,4417.78,100,103,42.891067961165049,42.891067961165049,null,8.791252089469076E-2,5.6589508757792381E-2,0.03,5.6589508757792381E-2,0.03,0,0,0,0,0,0,0,0,0.27962687141505466,0.67,0.27962687141505466,0.65048543689320393,0.66378361982715295,0.33,0.66378361982715295,0.32038834951456313]
["Day 1","2025-04-07",40092,{"$f":"COUNTIFS('Sanitized Raw Data'!$H:$H,\">=\"&$B4,'Sanitized Raw Data'!$H:$H,\"<\"&$B5,'Sanitized Raw Data'!$D:$D,\"Matching Grant\")","v":0},{"$f":"SUMIFS('Sanitized Raw Data'!$C:$C,'Sanitized Raw Data'!$H:$H,\">=\"&$B4,'Sanitized Raw Data'!$H:$H,\"<\"&$B5,'Sanitized Raw Data'!$D:$D,\"Matching Grant\")","v":0},{"$f":"COUNTIFS('Sanitized Raw Data'!$H:$H,\">=\"&$B4,'Sanitized Raw Data'!$H:$H,\"<\"&$B5,'Sanitized Raw Data'!$D:$D,\"Cash\")","v":0},{"$f":"SUMIFS('Sanitized Raw Data'!$C:$C,'Sanitized Raw Data'!$H:$H,\">=\"&$B4,'Sanitized Raw Data'!$H:$H,\"<\"&$B5,'Sanitized Raw Data'!$D:$D,\"Cash\")","v":0},{"$f":"COUNTIFS('Sanitized Raw Data'!$H:$H,\">=\"&$B4,'Sanitized Raw Data'!$H:$H,\"<\"&$B5,'Sanitized Raw Data'!$D:$D,\"CC\")","v":9},{"$f":"SUMIFS('Sanitized Raw Data'!$C:$C,'Sanitized Raw Data'!$H:$H,\">=\"&$B4,'Sanitized Raw Data'!$H:$H,\"<\"&$B5,'Sanitized Raw Data'!$D:$D,\"CC\")","v":1205},{"$f":"COUNTIFS('Sanitized Raw Data'!$H:$H,\">=\"&$B4,'Sanitized Raw Data'!$H:$H,\"<\"&$B5,'Sanitized Raw Data'!$D:$D,\"PayPal\")","v":3},{"$f":"SUMIFS('Sanitized Raw Data'!$C:$C,'Sanitized Raw Data'!$H:$H,\">=\"&$B4,'Sanitized Raw Data'!$H:$H,\"<\"&$B5,'Sanitized Raw Data'!$D:$D,\"PayPal\")","v":159.88999999999999},{"$f":"COUNTIFS('Sanitized Raw Data'!$H:$H,\">=\"&$B4,'Sanitized Raw Data'!$H:$H,\"<\"&$B5,'Sanitized Raw Data'!$D:$D,\"Personal Check\")+COUNTIFS('Sanitized Raw Data'!$H:$H,\">=\"&$B4,'Sanitized Raw Data'!$H:$H,\"<\"&$B5,'Sanitized Raw Data'!$D:$D,\"ACH Grant Deposit\")","v":0},{"$f":"SUMIFS('Sanitized Raw Data'!$C:$C,'Sanitized Raw Data'!$H:$H,\">=\"&$B4,'Sanitized Raw Data'!$H:$H,\"<\"&$B5,'Sanitized Raw Data'!$D:$D,\"Personal Check\")+SUMIFS('Sanitized Raw Data'!$C:$C,'Sanitized Raw Data'!$H:$H,\">=\"&$B4,'Sanitized Raw Data'!$H:$H,\"<\"&$B5,'Sanitized Raw Data'!$D:$D,\"ACH Grant Deposit\")","v":0},{"$f":"SUM(G4,M4,K4,I4,N3,E4)","v":9577.5300000000007},{"$f":"SUM(F4,H4,J4,L4,D4)","v":12},{"$f":"SUM(F4,L4,J4,H4,P3,D4)","v":109},{"$f":"N4/P4","v":87.86724770642202},113.74083333333333,{"$f":"N4/Sheet11!$A1","v":9577.5300000000007},{"$f":"(N4-N3)/C$3","v":3.4043948917489762E-2},{"$f":"E4/(N4-N3)","v":0},0,{"$f":"SUM(E$3:E4)/N4","v":0},{"$f":"SUM(D$3:D4)/O4","v":0},{"$f":"G4/(N4-N3)","v":0},0,{"$f":"SUM(G$3:G4)/N4","v":0},{"$f":"SUM(F$3:F4)/O4","v":0},{"$f":"I4/(N4-N3)","v":0.88285502861036458},{"$f":"H4/O4","v":0.75},{"$f":"SUM(I$3:I4)/N4","v":0.1258153198162783},{"$f":"SUM(H$3:H4)/P4","v":8.2568807339449546E-2},{"$f":"K4/(N4-N3)","v":0.11714497138963584},{"$f":"J4/O4","v":0.25},{"$f":"SUM(K$3:K4)/N4","v":0.35044839327049881},{"$f":"SUM(J$3:J4)/P4","v":0.61467889908256879},{"$f":"M4/(N4-N3)","v":0},{"$f":"L4/O4","v":0},{"$f":"SUM(M$3:M4)/N4","v":0.52373628691322294},{"$f":"SUM(L$3:L4)/P4","v":0.30275229357798167},null,"Day 1","2024-10-07",40465,0,0,0,0,23,1909.17,5,309.79000000000002,0,0,6359.08,28,128,49.680312499999999,79.248571428571424,6359.08,5.4836525392314345E-2,0,0,0,0,0,0,0,0,0.86038955186213362,0.8214285714285714,0.30022739138365928,0.1796875,0.13961044813786638,0.17857142857142858,0.17491995697490831,0.5,0,0,0.52485265164143236,0.3203125,null,"Day 1","2024-04-16",39822,0,0,0,0,174,13785.690000000002,22,1416,8,864.63,22872.440000000002,204,323,70.812507739938084,78.756470588235317,22872.440000000002,0.40345336748530969,0,0,0,0,0,0,0,0,0.85804901184589877,0.8529411764705882,0.60272056676069541,0.53869969040247678,8.8134681744170398E-2,0.10784313725490197,0.11566496622135634,0.30959752321981426,5.3816306409930827E-2,3.9215686274509803E-2,0.28161446701794823,0.15170278637770898,null,"Day 1","2023-10-02",48752,0,0,0,0,40,3194.78,10,559.46999999999991,3,639.79,10857.81,53,187,58.063155080213903,82.906415094339621,10857.81,9.0130456186412869E-2,0,0,4.6049801939801859E-3,1.8867924528301886E-2,0,0,0,0,0.72707121464529234,0.75471698113207553,0.29604588770663703,0.21925133689839571,0.12732473987492146,0.18867924528301888,0.27331478447311197,0.5668449197860963,0.14560404547978625,5.6603773584905662E-2,0.42603434762627079,0.20855614973262032,null,"Day 1","2023-04-11",50252,0,0,0,0,17,1673.52,4,234,1,50,6375.2999999999993,22,125,51.002399999999994,88.978181818181824,6375.2999999999993,3.8954071479742093E-2,0,0,3.9213840917290174E-2,0.13636363636363635,0,0,0,0,0.8549184682659694,0.77272727272727271,0.26250058820761379,0.13600000000000001,0.11953900854141979,0.18181818181818182,0.23047229150000789,0.56799999999999995,2.5542523192611064E-2,4.5454545454545456E-2,0.46781327937508826,0.27200000000000002]
["Day 2","2025-04-08",40092,{"$f":"COUNTIFS('Sanitized Raw Data'!$H:$H,\">=\"&$B5,'Sanitized Raw Data'!$H:$H,\"<\"&$B6,'Sanitized Raw Data'!$D:$D,\"Matching Grant\")","v":0},{"$f":"SUMIFS('Sanitized Raw Data'!$C:$C,'Sanitized Raw Data'!$H:$H,\">=\"&$B5,'Sanitized Raw Data'!$H:$H,\"<\"&$B6,'Sanitized Raw Data'!$D:$D,\"Matching Grant\")","v":0},{"$f":"COUNTIFS('Sanitized Raw Data'!$H:$H,\">=\"&$B5,'Sanitized Raw Data'!$H:$H,\"<\"&$B6,'Sanitized Raw Data'!$D:$D,\"Cash\")","v":0},{"$f":"SUMIFS('Sanitized Raw Data'!$C:$C,'Sanitized Raw Data'!$H:$H,\">=\"&$B5,'Sanitized Raw Data'!$H:$H,\"<\"&$B6,'Sanitized Raw Data'!$D:$D,\"Cash\")","v":0},{"$f":"COUNTIFS('Sanitized Raw Data'!$H:$H,\">=\"&$B5,'Sanitized Raw Data'!$H:$H,\"<\"&$B6,'Sanitized Raw Data'!$D:$D,\"CC\")","v":143},{"$f":"SUMIFS('Sanitized Raw Data'!$C:$C,'Sanitized Raw Data'!$H:$H,\">=\"&$B5,'Sanitized Raw Data'!$H:$H,\"<\"&$B6,'Sanitized Raw Data'!$D:$D,\"CC\")","v":10875.62},{"$f":"COUNTIFS('Sanitized Raw Data'!$H:$H,\">=\"&$B5,'Sanitized Raw Data'!$H:$H,\"<\"&$B6,'Sanitized Raw Data'!$D:$D,\"PayPal\")","v":25},{"$f":"SUMIFS('Sanitized Raw Data'!$C:$C,'Sanitized Raw Data'!$H:$H,\">=\"&$B5,'Sanitized Raw Data'!$H:$H,\"<\"&$B6,'Sanitized Raw Data'!$D:$D,\"PayPal\")","v":1309.1399999999999},{"$f":"COUNTIFS('Sanitized Raw Data'!$H:$H,\">=\"&$B5,'Sanitized Raw Data'!$H:$H,\"<\"&$B6,'Sanitized Raw Data'!$D:$D,\"Personal Check\")+COUNTIFS('Sanitized Raw Data'!$H:$H,\">=\"&$B5,'Sanitized Raw Data'!$H:$H,\"<\"&$B6,'Sanitized Raw Data'!$D:$D,\"ACH Grant Deposit\")","v":5},{"$f":"SUMIFS('Sanitized Raw Data'!$C:$C,'Sanitized Raw Data'!$H:$H,\">=\"&$B5,'Sanitized Raw Data'!$H:$H,\"<\"&$B6,'Sanitized Raw Data'!$D:$D,\"Personal Check\")+SUMIFS('Sanitized Raw Data'!$C:$C,'Sanitized Raw Data'!$H:$H,\">=\"&$B5,'Sanitized Raw Data'!$H:$H,\"<\"&$B6,'Sanitized Raw Data'!$D:$D,\"ACH Grant Deposit\")","v":810},{"$f":"SUM(G5,M5,K5,I5,N4,E5)","v":22572.29},{"$f":"SUM(F5,H5,J5,L5,D5)","v":173},{"$f":"SUM(F5,L5,J5,H5,P4,D5)","v":282},{"$f":"N5/P5","v":80.043581560283684},{"$f":"(SUM(G5,M5,K5,I5,E5))/(SUM(F5,H5,J5,L5,D5))","v":75.114219653179191},{"$f":"N5/Sheet11!$A2","v":11286.145},{"$f":"(N5-N4)/C$3","v":0.32412351591339916},{"$f":"E5/(N5-N4)","v":0},{"$f":"D5/O5","v":0},{"$f":"SUM(E$3:E5)/N5","v":0},{"$f":"SUM(D$3:D5)/O5","v":0},{"$f":"G5/(N5-N4)","v":0},{"$f":"F5/O5","v":0},{"$f":"SUM(G$3:G5)/N5","v":0},{"$f":"SUM(F$3:F5)/O5","v":0},{"$f":"I5/(N5-N4)","v":0.83692349839473756},{"$f":"H5/O5","v":0.82658959537572252},{"$f":"SUM(I$3:I5)/N5","v":0.53519691621895693},{"$f":"SUM(H$3:H5)/P5","v":0.53900709219858156},{"$f":"K5/(N5-N4)","v":0.10074368437739518},{"$f":"J5/O5","v":0.14450867052023122},{"$f":"SUM(K$3:K5)/N5","v":0.20669457994736026},{"$f":"SUM(J$3:J5)/P5","v":0.32624113475177308},{"$f":"M5/(N5-N4)","v":6.2332817227867231E-2},{"$f":"L5/O5","v":2.8901734104046242E-2},{"$f":"SUM(M$3:M5)/N5","v":0.25810850383368283},{"$f":"SUM(L$3:L5)/P5","v":0.13475177304964539},null,"Day 2","2024-10-08",40465,0,0,0,0,143,10161.380000000001,14,768.46999999999991,14,1461.4299999999998,18750.36,171,299,62.710234113712374,72.463625730994153,9375.18,0.30622216730507845,0,0,0,0,0,0,0,0,0.82004280429463305,0.83625730994152048,0.64375030666077881,0.55518394648829428,6.2016999050945494E-2,8.1871345029239762E-2,0.10030740743111063,0.2608695652173913,0.11794019665442147,8.1871345029239762E-2,0.25594228590811058,0.18394648829431437,null,"Day 2","2024-04-17",39822,0,0,0,0,66,4377.3100000000004,5,234,3,250,27733.750000000004,74,397,69.858312342569278,65.693378378378384,13866.875000000002,0.12207598814725532,0,0,0,0,0,0,0,0,0.9004383592077031,0.89189189189189189,0.65490602605129133,0.60453400503778343,4.8135173440903775E-2,6.7567567567567571E-2,0.10382800739171585,0.26448362720403024,5.1426467351392925E-2,4.0540540540540543E-2,0.24126596655699281,0.13098236775818639,null,"Day 2","2023-10-03",48752,0,0,0,0,69,5796.7,20,1155,4,296,18105.509999999998,93,280,64.66253571428571,77.932258064516134,9052.7549999999992,0.14866467016737772,0,0,2.7615902562258673E-3,1.0752688172043012E-2,0,0,0,0,0.7997985567835314,0.74193548387096775,0.49769987147558953,0.39285714285714285,0.15936090069953229,0.21505376344086022,0.22769863980633523,0.45,4.0840542516936411E-2,4.3010752688172046E-2,0.27183989846184942,0.15357142857142858,null,"Day 2","2023-04-12",50252,0,0,0,0,153,11667.580000000002,38,1535.9999999999998,13,990,20568.88,204,329,62.519392097264443,69.576372549019609,10284.44,0.28244806176868587,0,0,1.2154283558463076E-2,1.4705882352941176E-2,0,0,0,0,0.82203221456461306,0.75,0.6486060495272471,0.51671732522796354,0.10821794078731367,0.18627450980392157,0.14611053202702334,0.33130699088145898,6.9749844648073281E-2,6.3725490196078427E-2,0.19312913488726657,0.14285714285714285]
["Day 3","2025-04-09",40092,{"$f":"COUNTIFS('Sanitized Raw Data'!$H:$H,\">=\"&$B6,'Sanitized Raw Data'!$H:$H,\"<\"&$B7,'Sanitized Raw Data'!$D:$D,\"Matching Grant\")","v":0},{"$f":"SUMIFS('Sanitized Raw Data'!$C:$C,'Sanitized Raw Data'!$H:$H,\">=\"&$B6,'Sanitized Raw Data'!$H:$H,\"<\"&$B7,'Sanitized Raw Data'!$D:$D,\"Matching Grant\")","v":0},{"$f":"COUNTIFS('Sanitized Raw Data'!$H:$H,\">=\"&$B6,'Sanitized Raw Data'!$H:$H,\"<\"&$B7,'Sanitized Raw Data'!$D:$D,\"Cash\")","v":0},{"$f":"SUMIFS('Sanitized Raw Data'!$C:$C,'Sanitized Raw Data'!$H:$H,\">=\"&$B6,'Sanitized Raw Data'!$H:$H,\"<\"&$B7,'Sanitized Raw Data'!$D:$D,\"Cash\")","v":0},{"$f":"COUNTIFS('Sanitized Raw Data'!$H:$H,\">=\"&$B6,'Sanitized Raw Data'!$H:$H,\"<\"&$B7,'Sanitized Raw Data'!$D:$D,\"CC\")","v":28},{"$f":"SUMIFS('Sanitized Raw Data'!$C:$C,'Sanitized Raw Data'!$H:$H,\">=\"&$B6,'Sanitized Raw Data'!$H:$H,\"<\"&$B7,'Sanitized Raw Data'!$D:$D,\"CC\")","v":1832.57},{"$f":"COUNTIFS('Sanitized Raw Data'!$H:$H,\">=\"&$B6,'Sanitized Raw Data'!$H:$H,\"<\"&$B7,'Sanitized Raw Data'!$D:$D,\"PayPal\")","v":6},{"$f":"SUMIFS('Sanitized Raw Data'!$C:$C,'Sanitized Raw Data'!$H:$H,\">=\"&$B6,'Sanitized Raw Data'!$H:$H,\"<\"&$B7,'Sanitized Raw Data'!$D:$D,\"PayPal\")","v":142.47},{"$f":"COUNTIFS('Sanitized Raw Data'!$H:$H,\">=\"&$B6,'Sanitized Raw Data'!$H:$H,\"<\"&$B7,'Sanitized Raw Data'!$D:$D,\"Personal Check\")+COUNTIFS('Sanitized Raw Data'!$H:$H,\">=\"&$B6,'Sanitized Raw Data'!$H:$H,\"<\"&$B7,'Sanitized Raw Data'!$D:$D,\"ACH Grant Deposit\")","v":1},{"$f":"SUMIFS('Sanitized Raw Data'!$C:$C,'Sanitized Raw Data'!$H:$H,\">=\"&$B6,'Sanitized Raw Data'!$H:$H,\"<\"&$B7,'Sanitized Raw Data'!$D:$D,\"Personal Check\")+SUMIFS('Sanitized Raw Data'!$C:$C,'Sanitized Raw Data'!$H:$H,\">=\"&$B6,'Sanitized Raw Data'!$H:$H,\"<\"&$B7,'Sanitized Raw Data'!$D:$D,\"ACH Grant Deposit\")","v":50},{"$f":"SUM(G6,M6,K6,I6,N5,E6)","v":24597.33},{"$f":"SUM(F6,H6,J6,L6,D6)","v":35},{"$f":"SUM(F6,L6,J6,H6,P5,D6)","v":317},{"$f":"N6/P6","v":77.594100946372251},{"$f":"(SUM(G6,M6,K6,I6,E6))/(SUM(F6,H6,J6,L6,D6))","v":57.858285714285714},{"$f":"N6/Sheet11!$A3","v":8199.11},{"$f":"(N6-N5)/C$3","v":5.050982739698695E-2},{"$f":"E6/(N6-N5)","v":0},{"$f":"D6/O6","v":0},{"$f":"SUM(E$3:E6)/N6","v":0},{"$f":"SUM(D$3:D6)/O6","v":0},{"$f":"G6/(N6-N5)","v":0},{"$f":"F6/O6","v":0},{"$f":"SUM(G$3:G6)/N6","v":0},{"$f":"SUM(F$3:F6)/O6","v":0},{"$f":"I6/(N6-N5)","v":0.90495496385256546},{"$f":"H6/O6","v":0.8},{"$f":"SUM(I$3:I6)/N6","v":0.56563822170942946},{"$f":"SUM(H$3:H6)/P6","v":0.56782334384858046},{"$f":"K6/(N6-N5)","v":7.0354165843637628E-2},{"$f":"J6/O6","v":0.17142857142857143},{"$f":"SUM(K$3:K6)/N6","v":0.19546999613372673},{"$f":"SUM(J$3:J6)/P6","v":0.30914826498422715},{"$f":"M6/(N6-N5)","v":2.4690870303796457E-2},{"$f":"L6/O6","v":2.8571428571428571E-2},{"$f":"SUM(M$3:M6)/N6","v":0.23889178215684384},{"$f":"SUM(L$3:L6)/P6","v":0.12302839116719243},null,"Day 3","2024-10-09",40465,0,0,0,0,20,1175.31,4,205,5,251,20381.670000000002,29,328,62.139237804878057,56.252068965517239,6793.89,4.0314098603731655E-2,0,0,0,0,0,0,0,0,0.72047005167625955,0.68965517241379315,0.64989080875119654,0.56707317073170727,0.12566587589115485,0.13793103448275862,0.10233705088935301,0.25,0.15386407243258474,0.17241379310344829,0.24777214035945042,0.18292682926829268,null,"Day 3","2024-04-18",39822,0,0,0,0,36,2458.58,1,19.79,2,94.789999999999992,30306.910000000003,39,436,69.511261467889909,65.978461538461531,10102.303333333335,6.4616543619105016E-2,0,0,0,0,0,0,0,0,0.95547109390787988,0.92307692307692313,0.6804250251840257,0.6330275229357798,7.6909325498608714E-3,2.564102564102564E-2,9.5665641927863962E-2,0.24311926605504589,3.6837973542259324E-2,5.128205128205128E-2,0.2239093328881103,0.12385321100917432,null,"Day 3","2023-10-04",48752,0,0,0,0,23,1980.77,6,283,4,185,20554.28,33,313,65.668626198083061,74.205151515151513,6851.4266666666663,5.0229118805382354E-2,0,0,2.4325833840932402E-3,3.0303030303030304E-2,0,0,0,0,0.80888364362516674,0.69696969696969702,0.53477329295893616,0.42492012779552718,0.11556822404717468,0.18181818181818182,0.21433978713922358,0.4217252396166134,7.5548132327658363E-2,0.12121212121212122,0.24845433651774712,0.15015974440894569,null,"Day 3","2023-04-13",50252,0,0,0,0,26,1638.29,8,459.79,9,1310,23976.959999999999,43,372,64.454193548387096,79.257674418604651,7992.32,6.7819788267133613E-2,0,0,1.0426676275891522E-2,6.9767441860465115E-2,0,0,0,0,0.48070761249735949,0.60465116279069764,0.62474100136130706,0.5268817204301075,0.13491173916105265,0.18604651162790697,0.14451873798846893,0.31451612903225806,0.38438064834158842,0.20930232558139536,0.22031358437433268,0.15053763440860216]
{"$rows_left_out":42}
{"sheet":"Sanitized Raw Data","index":6,"n_rows":497,"n_cols":12,"rows_kept":497,"cut":false,"hidden":false,"merged":[]}
["donate_id","donate_invoice","donate_amount","donate_method","donate_affiliation","donate_classyear","donate_isthanked","donate_transac_date","donate_create_date","donate_mod_date","donate_num_recurring","donate_pledge"]
[61359,"EF57-000001",64,"Personal Check",1,1964,"N","2024-10-12","2024-10-19T02:04:03","2024-10-19T02:04:03",1,"None. Donation by check."]
[61360,"EF57-000002",40,"Personal Check",1,1968,"N","2024-10-09","2024-10-19T02:05:54","2024-10-19T02:05:54",1,"None. Donation by check."]
[61361,"EF57-000003",50,"Personal Check",1,1968,"N","2024-10-16","2024-10-19T02:07:29","2024-10-19T02:07:29",1,"None. Donation by check."]
[61362,"EF57-000004",50,"Personal Check",1,1975,"N","2024-10-08","2024-10-19T02:09:04","2024-10-19T02:10:28",1,"None. Donation by check."]
[61363,"EF57-000005",50,"Personal Check",1,1960,"N","2024-10-16","2024-10-28T14:09:52","2024-10-28T14:09:52",1,"None. Donation by check."]
{"$rows_left_out":492}
{"sheet":"Sheet11","index":7,"n_rows":62,"n_cols":1,"rows_kept":62,"cut":false,"hidden":true,"merged":[]}
[1]
[2]
[3]
[4]
[5]
[6]
{"$rows_left_out":56}