{"text_format":"1","workbook":"xlsx","n_sheets":8,"sheets":["Running Totals","Donation Averages","Income Source Analytics","Donations by Class","Fund Drive Budget History","Tables","Sanitized Raw Data","Sheet11"],"not_rendered":{"charts":10,"images":0,"macros":1,"external_links":0,"defined_names":1,"comments":0,"pivot_tables":1},"unopened":[],"bounds":{"document_bytes":16777216,"sheet_cells":100000,"rows_first":2000,"rows_last":500,"rows_between":2000,"halvings":0,"cell_chars":16384,"cell_head_chars":4096},"cells_cut":0,"cells_raw":0,"read":"whole","date_system":"1900"}

{"sheet":"Running Totals","index":0,"n_rows":0,"n_cols":0,"rows_kept":0,"cut":false,"hidden":false,"merged":[]}

{"sheet":"Donation Averages","index":1,"n_rows":0,"n_cols":0,"rows_kept":0,"cut":false,"hidden":false,"merged":[]}

{"sheet":"Income Source Analytics","index":2,"n_rows":0,"n_cols":0,"rows_kept":0,"cut":false,"hidden":false,"merged":[]}

{"sheet":"Donations by Class","index":3,"n_rows":113,"n_cols":4,"rows_kept":113,"cut":false,"hidden":false,"merged":[]}
[]
[]
[]
[]
[]
[]
{"$rows_left_out":108}
{"sheet":"Fund Drive Budget History","index":4,"n_rows":40,"n_cols":3,"rows_kept":40,"cut":false,"hidden":false,"merged":[]}
[8,"Fall 2000",68617]
[9,"Spring 2001",102827]
[10,"Fall 2001",95623]
[11,"Spring 2002",111701]
[12,"Fall 2002",106844]
[13,"Spring 2003",102871]
{"$rows_left_out":35}
{"sheet":"Tables","index":5,"n_rows":47,"n_cols":174,"rows_kept":47,"cut":false,"hidden":false,"merged":[[0,140,0,173],[0,0,0,33],[0,35,0,68],[0,70,0,103],[0,105,0,138]]}
[null,null,null,null,null,null,null,null,null,null,null,null,null,null,null,null,null,null,null,null,null,null,null,null,null,null,null,null,null,null,null,null,null,null,null,"FD 46",null,null,null,null,null,null,null,null,null,null,null,null,null,null,null,null,null,null,null,null,null,null,null,null,null,null,null,null,null,null,null,null,null,null,"FD 45",null,null,null,null,null,null,null,null,null,null,null,null,null,null,null,null,null,null,null,null,null,null,null,null,null,null,null,null,null,null,null,null,null,null,"FD 44",null,null,null,null,null,null,null,null,null,null,null,null,null,null,null,null,null,null,null,null,null,null,null,null,null,null,null,null,null,null,null,null,null,null,"FD 43"]
["Day","Date","Goal","Cash #","Cash Amt","Credit Card #","Credit Card Amt","PayPal #","PayPal Amt","Check #","Check Amt","Operating Budget","Donations by Day","Total Donations","Avg Overall Donation Amt","Avg Donation/Day","Average Donated Daily","Daily % of Goal","Daily % Cash $","Daily % Cash #","Overall % Cash $","Overall % Cash #","Daily % CC $","Daily % CC #","Overall % CC $","Overall % CC #","Daily % PP $","Daily % PP #","Overall % PP $","Overall % PP #","Daily % Chk $","Daily % Chk #","Overall % Chk $","Overall % Chk #",null,"Day","Date","Goal","Cash #","Cash Amt","Credit Card #","Credit Card Amt","PayPal #","PayPal Amt","Check #","Check Amt","Operating Budget","Donations by Day","Total Donations","Avg Overall Donation Amt","Avg Donation/Day","Average Donated  Daily","Daily % of Goal","Daily % Cash $","Daily % Cash #","Overall % Cash $","Overall % Cash #","Daily % CC $","Daily % CC #","Overall % CC $","Overall % CC #","Daily % PP $","Daily % PP #","Overall % PP $","Overall % PP #","Daily % Chk $","Daily % Chk #","Overall % Chk $","Overall % Chk #",null,"Day","Date","Goal","Cash #","Cash Amt","Credit Card #","Credit Card Amt","PayPal #","PayPal Amt","Check #","Check Amt","Operating Budget","Donations by Day","Total Donations","Avg Overall Donation Amt","Avg Donation/Day","Average Donated Daily","Daily % of Goal","Daily % Cash $","Daily % Cash #","Overall % Cash $","Overall % Cash #","Daily % CC $","Daily % CC #","Overall % CC $","Overall % CC #","Daily % PP $","Daily % PP #","Overall % PP $","Overall % PP #","Daily % Chk $","Daily % Chk #","Overall % Chk $","Overall % Chk #",null,"Day","Date","Goal","Cash #","Cash Amt","Credit Card #","Credit Card Amt","PayPal #","PayPal Amt","Check #","Check Amt","Operating Budget","Donations by Day","Total Donations","Avg Overall Donation Amt","Avg Donation/Day","Average Donated Daily","Daily % of Goal","Daily % Cash $","Daily % Cash #","Overall % Cash $","Overall % Cash #","Daily % CC $","Daily % CC #","Overall % CC $","Overall % CC #","Daily % PP $","Daily % PP #","Overall % PP $","Overall % PP #","Daily % Chk $","Daily % Chk #","Overall % Chk $","Overall % Chk #",null,"Day","Date","Goal","Cash #","Cash Amt","Credit Card #","Credit Card Amt","PayPal #","PayPal Amt","Check #","Check Amt","Operating Budget","Donations by Day","Total Donations","Avg Overall Donation Amt","Avg Donation/Day","Average Donated Daily","Daily % of Goal","Daily % Cash $","Daily % Cash #","Overall % Cash $","Overall % Cash #","Daily % CC $","Daily % CC #","Overall % CC $","Overall % CC #","Daily % PP $","Daily % PP #","Overall % PP $","Overall % PP #","Daily % Chk $","Daily % Chk #","Overall % Chk $","Overall % Chk #"]
["Pre-Fund Drive",null,65854,{"$f":"COUNTIFS('Sanitized Raw Data'!$H:$H,\"<\"&B4,'Sanitized Raw Data'!$D:$D,\"Cash\")","v":0},{"$f":"SUMIFS('Sanitized Raw Data'!$C:$C,'Sanitized Raw Data'!$H:$H,\"<\"&B4,'Sanitized Raw Data'!$D:$D,\"Cash\")","v":0},{"$f":"COUNTIFS('Sanitized Raw Data'!$H:$H,\"<\"&B4,'Sanitized Raw Data'!$D:$D,\"CC\")","v":21},{"$f":"SUMIFS('Sanitized Raw Data'!$C:$C,'Sanitized Raw Data'!$H:$H,\"<\"&B4,'Sanitized Raw Data'!$D:$D,\"CC\")","v":2460.69},{"$f":"COUNTIFS('Sanitized Raw Data'!$H:$H,\"<\"&B4,'Sanitized Raw Data'!$D:$D,\"PayPal\")","v":165},{"$f":"SUMIFS('Sanitized Raw Data'!$C:$C,'Sanitized Raw Data'!$H:$H,\"<\"&B4,'Sanitized Raw Data'!$D:$D,\"PayPal\")","v":3373.7200000000003},{"$f":"COUNTIFS('Sanitized Raw Data'!$H:$H,\"<\"&B4,'Sanitized Raw Data'!$D:$D,\"Personal Check\")","v":66},{"$f":"SUMIFS('Sanitized Raw Data'!$C:$C,'Sanitized Raw Data'!$H:$H,\"<\"&B4,'Sanitized Raw Data'!$D:$D,\"Personal Check\")","v":5705.66},{"$f":"SUM(E3,K3,I3,G3)","v":11540.070000000002},{"$f":"SUM(D3,F3,H3,J3)","v":252},{"$f":"SUM(D3,J3,H3,F3)","v":252},{"$f":"L3/N3","v":45.79392857142858},{"$f":"(SUM(E3,K3,I3,G3))/(SUM(D3,F3,H3,J3))","v":45.79392857142858},null,{"$f":"(L3/C$3)","v":0.17523719136271149},{"$f":"E3/L3","v":0},{"$f":"D3/M3","v":0},{"$f":"B3/H3","v":0},{"$f":"B3/J3","v":0},{"$f":"G3/L3","v":0.21323007572744357},{"$f":"F3/M3","v":8.3333333333333329E-2},{"$f":"F3/L3","v":1.8197463273619656E-3},{"$f":"F3/N3","v":8.3333333333333329E-2},{"$f":"I3/L3","v":0.29234831331179101},{"$f":"H3/M3","v":0.65476190476190477},{"$f":"I3/L3","v":0.29234831331179101},{"$f":"H3/N3","v":0.65476190476190477},{"$f":"K3/L3","v":0.49442161096076531},{"$f":"J3/M3","v":0.26190476190476192},{"$f":"K3/L3","v":0.49442161096076531},{"$f":"J3/N3","v":0.26190476190476192},null,"Pre-Fund Drive",null,76366,0,0,0,0,88,2170.8199999999997,29,2963.79,5134.6099999999997,117,117,43.885555555555555,43.885555555555555,null,6.7236859335306279E-2,0,0,0,0,0,0,0,0,0.42278186658772521,0.75213675213675213,0.42278186658772521,0.75213675213675213,0.57721813341227479,0.24786324786324787,0.57721813341227479,0.24786324786324787,null,"Pre-Fund Drive",null,74493,0,0,0,0,80,1382.78,44,5175.79,6558.57,124,124,52.891693548387096,52.891693548387096,null,8.8042769119246106E-2,0,0,0,0,0,0,0,0,0.21083559373460983,0.64516129032258063,0.21083559373460983,0.64516129032258063,0.78916440626539019,0.35483870967741937,0.78916440626539019,0.35483870967741937,null,"Pre-Fund Drive",null,74104,0,0,0,0,70,1421.71,22,1044.58,2466.29,92,92,26.807500000000001,26.807500000000001,null,3.3281469286408294E-2,0,0,0,0,0,0,0,0,0.57645694545248127,0.76086956521739135,0.57645694545248127,0.76086956521739135,0.42354305454751873,0.2391304347826087,0.42354305454751873,0.2391304347826087,null,"Pre-Fund Drive",null,96226,0,0,7,330,101,4160.26,29,2119.77,6610.0300000000007,137,137,48.248394160583949,48.248394160583949,null,6.8692764949182139E-2,0,0,0,0,4.9924130450240009E-2,5.1094890510948905E-2,1.0589967065202427E-3,5.1094890510948905E-2,0.62938594832398642,0.73722627737226276,0.62938594832398642,0.73722627737226276,0.3206899212257735,0.21167883211678831,0.3206899212257735,0.21167883211678831]
["Day 1","2020-07-15",65854,{"$f":"COUNTIFS('Sanitized Raw Data'!$H:$H,\">=\"&$B4,'Sanitized Raw Data'!$H:$H,\"<\"&$B5,'Sanitized Raw Data'!$D:$D,\"Cash\")","v":0},{"$f":"SUMIFS('Sanitized Raw Data'!$C:$C,'Sanitized Raw Data'!$H:$H,\">=\"&$B4,'Sanitized Raw Data'!$H:$H,\"<\"&$B5,'Sanitized Raw Data'!$D:$D,\"Cash\")","v":0},{"$f":"COUNTIFS('Sanitized Raw Data'!$H:$H,\">=\"&$B4,'Sanitized Raw Data'!$H:$H,\"<\"&$B5,'Sanitized Raw Data'!$D:$D,\"CC\")","v":203},{"$f":"SUMIFS('Sanitized Raw Data'!$C:$C,'Sanitized Raw Data'!$H:$H,\">=\"&$B4,'Sanitized Raw Data'!$H:$H,\"<\"&$B5,'Sanitized Raw Data'!$D:$D,\"CC\")","v":16744.550000000003},{"$f":"COUNTIFS('Sanitized Raw Data'!$H:$H,\">=\"&$B4,'Sanitized Raw Data'!$H:$H,\"<\"&$B5,'Sanitized Raw Data'!$D:$D,\"PayPal\")","v":9},{"$f":"SUMIFS('Sanitized Raw Data'!$C:$C,'Sanitized Raw Data'!$H:$H,\">=\"&$B4,'Sanitized Raw Data'!$H:$H,\"<\"&$B5,'Sanitized Raw Data'!$D:$D,\"PayPal\")","v":265},{"$f":"COUNTIFS('Sanitized Raw Data'!$H:$H,\">=\"&$B4,'Sanitized Raw Data'!$H:$H,\"<\"&$B5,'Sanitized Raw Data'!$D:$D,\"Personal Check\")","v":22},{"$f":"SUMIFS('Sanitized Raw Data'!$C:$C,'Sanitized Raw Data'!$H:$H,\">=\"&$B4,'Sanitized Raw Data'!$H:$H,\"<\"&$B5,'Sanitized Raw Data'!$D:$D,\"Personal Check\")","v":1490},{"$f":"SUM(E4,K4,I4,G4,L3)","v":30039.620000000003},234,{"$f":"SUM(D4,J4,H4,F4,N3)","v":486},{"$f":"L4/N4","v":61.80991769547326},{"$f":"(SUM(E4,K4,I4,G4))/(SUM(D4,F4,H4,J4))","v":79.057905982905993},{"$f":"L4/Sheet11!$A1","v":30039.620000000003},{"$f":"(L4-L3)/C$3","v":0.28091763598262826},{"$f":"E4/(L4-L3)","v":0},{"$f":"D4/M4","v":0},{"$f":"SUM(E$3:E4)/L4","v":0},{"$f":"SUM(D$3:D4)/M4","v":0},{"$f":"G4/(L4-L3)","v":0.90513282755526492},{"$f":"F4/M4","v":0.86752136752136755},{"$f":"SUM(G$3:G4)/L4","v":0.63933032441821835},{"$f":"SUM(F$3:F4)/N4","v":0.46090534979423869},{"$f":"I4/(L4-L3)","v":1.4324672762310432E-2},{"$f":"H4/M4","v":3.8461538461538464E-2},{"$f":"SUM(I$3:I4)/L4","v":0.12113069339758625},{"$f":"SUM(H$3:H4)/N4","v":0.35802469135802467},{"$f":"K4/(L4-L3)","v":8.054249968242469E-2},{"$f":"J4/M4","v":9.4017094017094016E-2},{"$f":"SUM(K$3:K4)/L4","v":0.23953898218419539},{"$f":"SUM(J$3:J4)/N4","v":0.18106995884773663},null,"Day 1","2019-10-07",76366,0,0,31,3227.28,11,474,6,569,9404.89,48,165,56.999333333333333,88.964166666666685,9404.89,5.5918602519445824E-2,0,0,0,0,0.75575372106747107,0.64583333333333337,0.34314914900652749,0.18787878787878787,0.11099974708918385,0.22916666666666666,0.28121753683456158,0.6,0.13324653184334517,0.125,0.37563331415891099,0.21212121212121213,null,"Day 1","2019-04-08",74493,0,0,124,7977.1900000000005,35,1338.46,20,1274.5900000000001,17148.810000000001,179,303,56.596732673267333,59.16335195530727,17148.810000000001,0.14216423019612584,0,0,0,0,0.75325866080466541,0.69273743016759781,0.46517455147033526,0.40924092409240925,0.12638618199398691,0.19553072625698323,0.15868389701676092,0.37953795379537952,0.12035515720134765,0.11173184357541899,0.37614155151290379,0.21122112211221122,null,"Day 1","2018-10-09",74104,0,0,123,9141.66,27,1652.8899999999999,21,1207.55,14468.39,171,263,55.012889733840304,70.187719298245611,14468.39,0.16196291698153945,0,0,0,0,0.76167170745119617,0.7192982456140351,0.63183671438218081,0.46768060836501901,0.13771673290507494,0.15789473684210525,0.21250463942428979,0.36882129277566539,0.10061155964372902,0.12280701754385964,0.15565864619352948,0.1634980988593156,null,"Day 1","2018-04-09",96226,0,0,78,5334.96,17,688.83999999999992,17,1118.79,13752.62,112,249,55.231405622489966,63.773125,13752.62,7.4227235882194001E-2,0,0,0,0,0.74692233489532511,0.6964285714285714,0.41191860169189576,0.34136546184738958,9.6441206901138082E-2,0.15178571428571427,0.35259463287722631,0.47389558232931728,0.1566364582035368,0.15178571428571427,0.23548676543087788,0.18473895582329317]
["Day 2","2020-07-16",65854,{"$f":"COUNTIFS('Sanitized Raw Data'!$H:$H,\">=\"&$B5,'Sanitized Raw Data'!$H:$H,\"<\"&$B6,'Sanitized Raw Data'!$D:$D,\"Cash\")","v":0},{"$f":"SUMIFS('Sanitized Raw Data'!$C:$C,'Sanitized Raw Data'!$H:$H,\">=\"&$B5,'Sanitized Raw Data'!$H:$H,\"<\"&$B6,'Sanitized Raw Data'!$D:$D,\"Cash\")","v":0},{"$f":"COUNTIFS('Sanitized Raw Data'!$H:$H,\">=\"&$B5,'Sanitized Raw Data'!$H:$H,\"<\"&$B6,'Sanitized Raw Data'!$D:$D,\"CC\")","v":47},{"$f":"SUMIFS('Sanitized Raw Data'!$C:$C,'Sanitized Raw Data'!$H:$H,\">=\"&$B5,'Sanitized Raw Data'!$H:$H,\"<\"&$B6,'Sanitized Raw Data'!$D:$D,\"CC\")","v":3898.15},{"$f":"COUNTIFS('Sanitized Raw Data'!$H:$H,\">=\"&$B5,'Sanitized Raw Data'!$H:$H,\"<\"&$B6,'Sanitized Raw Data'!$D:$D,\"PayPal\")","v":4},{"$f":"SUMIFS('Sanitized Raw Data'!$C:$C,'Sanitized Raw Data'!$H:$H,\">=\"&$B5,'Sanitized Raw Data'!$H:$H,\"<\"&$B6,'Sanitized Raw Data'!$D:$D,\"PayPal\")","v":330},{"$f":"COUNTIFS('Sanitized Raw Data'!$H:$H,\">=\"&$B5,'Sanitized Raw Data'!$H:$H,\"<\"&$B6,'Sanitized Raw Data'!$D:$D,\"Personal Check\")","v":11},{"$f":"SUMIFS('Sanitized Raw Data'!$C:$C,'Sanitized Raw Data'!$H:$H,\">=\"&$B5,'Sanitized Raw Data'!$H:$H,\"<\"&$B6,'Sanitized Raw Data'!$D:$D,\"Personal Check\")","v":970},{"$f":"SUM(E5,K5,I5,G5,L4)","v":35237.770000000004},{"$f":"SUM(D5,F5,H5,J5)","v":62},{"$f":"SUM(D5,J5,H5,F5,N4)","v":548},{"$f":"L5/N5","v":64.302500000000009},{"$f":"(SUM(E5,K5,I5,G5))/(SUM(D5,F5,H5,J5))","v":83.841129032258053},{"$f":"L5/Sheet11!$A2","v":17618.885000000002},{"$f":"(L5-L4)/C$3","v":7.8934461080572199E-2},{"$f":"E5/(L5-L4)","v":0},{"$f":"D5/M5","v":0},{"$f":"SUM(E$3:E5)/L5","v":0},{"$f":"SUM(D$3:D5)/M5","v":0},{"$f":"G5/(L5-L4)","v":0.74991102603810955},{"$f":"F5/M5","v":0.75806451612903225},{"$f":"SUM(G$3:G5)/L5","v":0.65564279464903708},{"$f":"SUM(F$3:F5)/N5","v":0.49452554744525545},{"$f":"I5/(L5-L4)","v":6.3484124159556746E-2},{"$f":"H5/M5","v":6.4516129032258063E-2},{"$f":"SUM(I$3:I5)/L5","v":0.11262687735347611},{"$f":"SUM(H$3:H5)/N5","v":0.32481751824817517},{"$f":"K5/(L5-L4)","v":0.18660484980233347},{"$f":"J5/M5","v":0.17741935483870969},{"$f":"SUM(K$3:K5)/L5","v":0.23173032799748675},{"$f":"SUM(J$3:J5)/N5","v":0.18065693430656934},null,"Day 2","2019-10-08",76366,0,0,71,4453.26,17,739.68000000000006,14,957,15554.83,102,267,58.257790262172286,60.293529411764709,7777.415,8.053243590079355E-2,0,0,0,0,0.72411438160372299,0.69607843137254899,0.49377203093830024,0.38202247191011235,0.12027434413994283,0.16666666666666666,0.21758514879301155,0.43445692883895132,0.1556112742563342,0.13725490196078433,0.28864282026868826,0.18352059925093633,null,"Day 2","2019-04-09",74493,0,0,31,2853.89,11,598,15,881,21481.7,57,360,59.671388888888892,76.015614035087708,10740.85,5.8165062489092929E-2,0,0,0,0,0.65865738571715415,0.54385964912280704,0.50420031934157905,0.43055555555555558,0.13801411990611348,0.19298245614035087,0.15451477303937769,0.35,0.20332849437673242,0.26315789473684209,0.34128490761904318,0.21944444444444444,null,"Day 2","2018-10-10",74104,0,0,31,9141.66,6,209.57999999999998,6,285,16847.739999999998,43,306,55.057973856209145,55.333720930232559,8423.869999999999,3.2108253265680647E-2,0,0,0,0,0.79213650786979684,0.72093023255813948,0.65447531835130424,0.50326797385620914,8.8082879778090706E-2,0.13953488372093023,0.19493297023814471,0.33660130718954251,0.11978061235211304,0.13953488372093023,0.15059171141055122,0.16013071895424835,null,"Day 2","2018-04-10",96226,0,0,24,1627.7,2,57,4,475,15912.32,30,279,57.033405017921147,71.989999999999995,7956.16,2.2444037993889374E-2,0,0,0,0,0.75366949113302817,0.8,0.4583027490648755,0.39068100358422941,2.6392554521461328E-2,6.6666666666666666E-2,0.30832084824840128,0.43010752688172044,0.21993795434551106,0.13333333333333333,0.23337640268672324,0.17921146953405018]
["Day 3","2020-07-17",65854,{"$f":"COUNTIFS('Sanitized Raw Data'!$H:$H,\">=\"&$B6,'Sanitized Raw Data'!$H:$H,\"<\"&$B7,'Sanitized Raw Data'!$D:$D,\"Cash\")","v":0},{"$f":"SUMIFS('Sanitized Raw Data'!$C:$C,'Sanitized Raw Data'!$H:$H,\">=\"&$B6,'Sanitized Raw Data'!$H:$H,\"<\"&$B7,'Sanitized Raw Data'!$D:$D,\"Cash\")","v":0},{"$f":"COUNTIFS('Sanitized Raw Data'!$H:$H,\">=\"&$B6,'Sanitized Raw Data'!$H:$H,\"<\"&$B7,'Sanitized Raw Data'!$D:$D,\"CC\")","v":28},{"$f":"SUMIFS('Sanitized Raw Data'!$C:$C,'Sanitized Raw Data'!$H:$H,\">=\"&$B6,'Sanitized Raw Data'!$H:$H,\"<\"&$B7,'Sanitized Raw Data'!$D:$D,\"CC\")","v":2220},{"$f":"COUNTIFS('Sanitized Raw Data'!$H:$H,\">=\"&$B6,'Sanitized Raw Data'!$H:$H,\"<\"&$B7,'Sanitized Raw Data'!$D:$D,\"PayPal\")","v":0},{"$f":"SUMIFS('Sanitized Raw Data'!$C:$C,'Sanitized Raw Data'!$H:$H,\">=\"&$B6,'Sanitized Raw Data'!$H:$H,\"<\"&$B7,'Sanitized Raw Data'!$D:$D,\"PayPal\")","v":0},{"$f":"COUNTIFS('Sanitized Raw Data'!$H:$H,\">=\"&$B6,'Sanitized Raw Data'!$H:$H,\"<\"&$B7,'Sanitized Raw Data'!$D:$D,\"Personal Check\")","v":5},{"$f":"SUMIFS('Sanitized Raw Data'!$C:$C,'Sanitized Raw Data'!$H:$H,\">=\"&$B6,'Sanitized Raw Data'!$H:$H,\"<\"&$B7,'Sanitized Raw Data'!$D:$D,\"Personal Check\")","v":489},{"$f":"SUM(E6,K6,I6,G6,L5)","v":37946.770000000004},{"$f":"SUM(D6,F6,H6,J6)","v":33},{"$f":"SUM(D6,J6,H6,F6,N5)","v":581},{"$f":"L6/N6","v":65.312857142857155},{"$f":"(SUM(E6,K6,I6,G6))/(SUM(D6,F6,H6,J6))","v":82.090909090909093},{"$f":"L6/Sheet11!$A3","v":12648.923333333334},{"$f":"(L6-L5)/C$3","v":4.1136453366538102E-2},{"$f":"E6/(L6-L5)","v":0},{"$f":"D6/M6","v":0},{"$f":"SUM(E$3:E6)/L6","v":0},{"$f":"SUM(D$3:D6)/M6","v":0},{"$f":"G6/(L6-L5)","v":0.81949058693244736},{"$f":"F6/M6","v":0.84848484848484851},{"$f":"SUM(G$3:G6)/L6","v":0.66733980257081171},{"$f":"SUM(F$3:F6)/N6","v":0.51462994836488818},{"$f":"I6/(L6-L5)","v":0},{"$f":"H6/M6","v":0},{"$f":"SUM(I$3:I6)/L6","v":0.10458650367343518},{"$f":"SUM(H$3:H6)/N6","v":0.30636833046471601},{"$f":"K6/(L6-L5)","v":0.18050941306755261},{"$f":"J6/M6","v":0.15151515151515152},{"$f":"SUM(K$3:K6)/L6","v":0.22807369375575309},{"$f":"SUM(J$3:J6)/N6","v":0.17900172117039587},null,"Day 3","2019-10-09",76366,0,0,17,1729,3,99.789999999999992,8,331,17714.62,28,295,60.049559322033893,77.135357142857146,5904.873333333333,2.828208888772489E-2,0,0,0,0,0.8005407933178692,0.6071428571428571,0.53117368591592717,0.4033898305084746,4.6203566087443707E-2,0.10714285714285714,0.19669007859045243,0.4033898305084746,0.15325564059468752,0.2857142857142857,0.27213623549362054,0.19322033898305085,null,"Day 3","2019-04-10",74493,0,0,21,999.63,3,235,5,275,22991.33,29,389,59.103676092544994,52.056206896551728,7663.7766666666676,2.0265394063871785E-2,0,0,0,0,0.66216887581725281,0.72413793103448276,0.51457266717497419,0.45244215938303339,0.15566728271165772,0.10344827586206896,0.15459044779053668,0.33161953727506427,0.18216384147108883,0.17241379310344829,0.33083688503448905,0.21593830334190231,null,"Day 3","2018-10-11",74104,0,0,16,9141.66,8,109.47,6,825,18856.859999999997,30,336,56.121607142857137,66.970666666666659,6285.619999999999,2.7112166684659385E-2,0,0,0,0,0.5348859202038706,0.53333333333333333,0.64173356539742044,0.50595238095238093,5.4486541371346689E-2,0.26666666666666666,0.1799689874135991,0.33035714285714285,0.41062753842478322,0.2,0.17829744718898061,0.16369047619047619,null,"Day 3","2018-04-11",96226,0,0,10,629.08999999999992,7,174.89,3,94.63,16810.93,20,299,56.223846153846154,44.930499999999995,5603.6433333333334,9.3385363623137256E-3,0,0,0,0,0.70007010827834049,0.5,0.4712261605990864,0.39799331103678931,0.19462280633422716,0.35,0.30224324293777921,0.42474916387959866,0.10530708538743162,0.15,0.22653059646313439,0.17725752508361203]
{"$rows_left_out":42}
{"sheet":"Sanitized Raw Data","index":6,"n_rows":969,"n_cols":12,"rows_kept":969,"cut":false,"hidden":false,"merged":[]}
["donate_id","donate_invoice","donate_amount","donate_method","donate_affiliation","donate_classyear","donate_isthanked","donate_transac_date","donate_create_date","donate_mod_date","donate_num_recurring","donate_pledge"]
[54014,"EF47-000001",20,"Personal Check",11,null,"N","2019-11-07","2019-11-07T17:45:00","2019-11-07T17:45:00",1,"None. Donation by check."]
[54015,"EF47-000002",100,"Personal Check",1,1969,"N","2019-10-31","2019-11-07T17:46:00","2019-11-07T17:46:00",1,"None. Donation by check."]
[54016,"EF47-000003",25,"Personal Check",1,1949,"N","2019-10-30","2019-11-07T18:26:00","2019-11-07T18:26:00",1,"None. Donation by check."]
[54017,"EF47-000004",500,"Personal Check",1,1951,"N","2019-11-01","2019-11-07T18:27:00","2019-11-07T18:29:00",1,"None. Donation by check."]
[54018,"EF47-000005",55,"Personal Check",1,1955,"N","2019-10-30","2019-11-07T18:29:00","2019-11-07T18:29:00",1,"None. Donation by check."]
{"$rows_left_out":964}
{"sheet":"Sheet11","index":7,"n_rows":62,"n_cols":1,"rows_kept":62,"cut":false,"hidden":true,"merged":[]}
[1]
[2]
[3]
[4]
[5]
[6]
{"$rows_left_out":56}