{"text_format":"1","workbook":"xlsx","n_sheets":8,"sheets":["Running Totals","Donation Averages","Income Source Analytics","Donations by Class","Fund Drive Budget History","Tables","Sanitized Raw Data","Sheet11"],"not_rendered":{"charts":10,"images":0,"macros":1,"external_links":0,"defined_names":1,"comments":0,"pivot_tables":1},"unopened":[],"bounds":{"document_bytes":16777216,"sheet_cells":100000,"rows_first":2000,"rows_last":500,"rows_between":2000,"halvings":0,"cell_chars":16384,"cell_head_chars":4096},"cells_cut":0,"cells_raw":0,"read":"whole","date_system":"1900"}

{"sheet":"Running Totals","index":0,"n_rows":0,"n_cols":0,"rows_kept":0,"cut":false,"hidden":false,"merged":[]}

{"sheet":"Donation Averages","index":1,"n_rows":0,"n_cols":0,"rows_kept":0,"cut":false,"hidden":false,"merged":[]}

{"sheet":"Income Source Analytics","index":2,"n_rows":0,"n_cols":0,"rows_kept":0,"cut":false,"hidden":false,"merged":[]}

{"sheet":"Donations by Class","index":3,"n_rows":105,"n_cols":4,"rows_kept":105,"cut":false,"hidden":false,"merged":[]}
[]
[]
[]
[]
[]
[]
{"$rows_left_out":100}
{"sheet":"Fund Drive Budget History","index":4,"n_rows":43,"n_cols":3,"rows_kept":43,"cut":false,"hidden":false,"merged":[]}
[8,"Fall 2000",68617]
[9,"Spring 2001",102827]
[10,"Fall 2001",95623]
[11,"Spring 2002",111701]
[12,"Fall 2002",106844]
[13,"Spring 2003",102871]
{"$rows_left_out":38}
{"sheet":"Tables","index":5,"n_rows":47,"n_cols":204,"rows_kept":47,"cut":false,"hidden":false,"merged":[[0,164,0,203],[0,0,0,39],[0,41,0,80],[0,82,0,121],[0,123,0,162]]}
["FD49",null,null,null,null,null,null,null,null,null,null,null,null,null,null,null,null,null,null,null,null,null,null,null,null,null,null,null,null,null,null,null,null,null,null,null,null,null,null,null,null,"FD 48",null,null,null,null,null,null,null,null,null,null,null,null,null,null,null,null,null,null,null,null,null,null,null,null,null,null,null,null,null,null,null,null,null,null,null,null,null,null,null,null,"FD 47",null,null,null,null,null,null,null,null,null,null,null,null,null,null,null,null,null,null,null,null,null,null,null,null,null,null,null,null,null,null,null,null,null,null,null,null,null,null,null,null,"FD 46",null,null,null,null,null,null,null,null,null,null,null,null,null,null,null,null,null,null,null,null,null,null,null,null,null,null,null,null,null,null,null,null,null,null,null,null,null,null,null,null,"FD 45"]
["Day","Date","Goal","Matching Grant #","Matching Grant Amt","Cash #","Cash Amt","Credit Card #","Credit Card Amt","PayPal #","PayPal Amt","Check #","Check Amt","Operating Budget","Donations by Day","Total Donations","Avg Overall Donation Amt","Avg Donation/Day","Average Donated Daily","Daily % of Goal","Daily % Matching $","Daily % Matching #","Overall %Matching $","Overall % Matching #","Daily % Cash $","Daily % Cash #","Overall % Cash $","Overall % Cash #","Daily % CC $","Daily % CC #","Overall % CC $","Overall % CC #","Daily % PP $","Daily % PP #","Overall % PP $","Overall % PP #","Daily % Chk $","Daily % Chk #","Overall % Chk $","Overall % Chk #",null,"Day","Date","Goal","Matching Grant #","Matching Grant Amt","Cash #","Cash Amt","Credit Card #","Credit Card Amt","PayPal #","PayPal Amt","Check #","Check Amt","Operating Budget","Donations by Day","Total Donations","Avg Overall Donation Amt","Avg Donation/Day","Average Donated  Daily","Daily % of Goal","Daily % Matching $","Daily % Matching #","Overall %Matching $","Overall % Matching #","Daily % Cash $","Daily % Cash #","Overall % Cash $","Overall % Cash #","Daily % CC $","Daily % CC #","Overall % CC $","Overall % CC #","Daily % PP $","Daily % PP #","Overall % PP $","Overall % PP #","Daily % Chk $","Daily % Chk #","Overall % Chk $","Overall % Chk #",null,"Day","Date","Goal","Matching Grant #","Matching Grant Amt","Cash #","Cash Amt","Credit Card #","Credit Card Amt","PayPal #","PayPal Amt","Check #","Check Amt","Operating Budget","Donations by Day","Total Donations","Avg Overall Donation Amt","Avg Donation/Day","Average Donated Daily","Daily % of Goal","Daily % Matching $","Daily % Matching #","Overall %Matching $","Overall % Matching #","Daily % Cash $","Daily % Cash #","Overall % Cash $","Overall % Cash #","Daily % CC $","Daily % CC #","Overall % CC $","Overall % CC #","Daily % PP $","Daily % PP #","Overall % PP $","Overall % PP #","Daily % Chk $","Daily % Chk #","Overall % Chk $","Overall % Chk #",null,"Day","Date","Goal","Matching Grant #","Matching Grant Amt","Cash #","Cash Amt","Credit Card #","Credit Card Amt","PayPal #","PayPal Amt","Check #","Check Amt","Operating Budget","Donations by Day","Total Donations","Avg Overall Donation Amt","Avg Donation/Day","Average Donated Daily","Daily % of Goal","Daily % Matching $","Daily % Matching #","Overall %Matching $","Overall % Matching #","Daily % Cash $","Daily % Cash #","Overall % Cash $","Overall % Cash #","Daily % CC $","Daily % CC #","Overall % CC $","Overall % CC #","Daily % PP $","Daily % PP #","Overall % PP $","Overall % PP #","Daily % Chk $","Daily % Chk #","Overall % Chk $","Overall % Chk #",null,"Day","Date","Goal","Matching Grant #","Matching Grant Amt","Cash #","Cash Amt","Credit Card #","Credit Card Amt","PayPal #","PayPal Amt","Check #","Check Amt","Operating Budget","Donations by Day","Total Donations","Avg Overall Donation Amt","Avg Donation/Day","Average Donated Daily","Daily % of Goal","Daily % Matching $","Daily % Matching #","Overall %Matching $","Overall % Matching #","Daily % Cash $","Daily % Cash #","Overall % Cash $","Overall % Cash #","Daily % CC $","Daily % CC #","Overall % CC $","Overall % CC #","Daily % PP $","Daily % PP #","Overall % PP $","Overall % PP #","Daily % Chk $","Daily % Chk #","Overall % Chk $","Overall % Chk #"]
["Pre-Fund Drive",null,52905,{"$f":"COUNTIFS('Sanitized Raw Data'!$H:$H,\"<\"&B4,'Sanitized Raw Data'!$D:$D,\"Matching Grant\")","v":20},{"$f":"SUMIFS('Sanitized Raw Data'!$C:$C,'Sanitized Raw Data'!$H:$H,\"<\"&B4,'Sanitized Raw Data'!$D:$D,\"Matching Grant\")","v":541.07000000000005},{"$f":"COUNTIFS('Sanitized Raw Data'!$H:$H,\"<\"&B4,'Sanitized Raw Data'!$D:$D,\"Cash\")","v":0},{"$f":"SUMIFS('Sanitized Raw Data'!$C:$C,'Sanitized Raw Data'!$H:$H,\"<\"&B4,'Sanitized Raw Data'!$D:$D,\"Cash\")","v":0},{"$f":"COUNTIFS('Sanitized Raw Data'!$H:$H,\"<\"&B4,'Sanitized Raw Data'!$D:$D,\"CC\")","v":3},{"$f":"SUMIFS('Sanitized Raw Data'!$C:$C,'Sanitized Raw Data'!$H:$H,\"<\"&B4,'Sanitized Raw Data'!$D:$D,\"CC\")","v":70},{"$f":"COUNTIFS('Sanitized Raw Data'!$H:$H,\"<\"&B4,'Sanitized Raw Data'!$D:$D,\"PayPal\")","v":122},{"$f":"SUMIFS('Sanitized Raw Data'!$C:$C,'Sanitized Raw Data'!$H:$H,\"<\"&B4,'Sanitized Raw Data'!$D:$D,\"PayPal\")","v":3596.8700000000008},{"$f":"COUNTIFS('Sanitized Raw Data'!$H:$H,\"<\"&B4,'Sanitized Raw Data'!$D:$D,\"Personal Check\")+COUNTIFS('Sanitized Raw Data'!$H:$H,\"<\"&B4,'Sanitized Raw Data'!$D:$D,\"ACH Grant Deposit\")","v":80},{"$f":"SUMIFS('Sanitized Raw Data'!$C:$C,'Sanitized Raw Data'!$H:$H,\"<\"&B4,'Sanitized Raw Data'!$D:$D,\"Personal Check\")+SUMIFS('Sanitized Raw Data'!$C:$C,'Sanitized Raw Data'!$H:$H,\"<\"&B4,'Sanitized Raw Data'!$D:$D,\"ACH Grant Deposit\")","v":6204.49},{"$f":"SUM(G3,M3,K3,I3,E3)","v":10412.43},{"$f":"SUM(F3,H3,J3,L3)","v":205},{"$f":"SUM(F3,L3,J3,H3,D3)","v":225},{"$f":"N3/P3","v":46.277466666666669},{"$f":"(SUM(G3,M3,K3,I3,E3))/(SUM(F3,H3,J3,L3,D3))","v":46.277466666666669},null,{"$f":"(N3/C$3)","v":0.19681372271051886},{"$f":"E3/N3","v":5.1963854738999449E-2},{"$f":"D3/O3","v":9.7560975609756101E-2},{"$f":"E3/N3","v":5.1963854738999449E-2},{"$f":"D3/O3","v":9.7560975609756101E-2},{"$f":"G3/N3","v":0},{"$f":"F3/O3","v":0},{"$f":"B3/J3","v":0},{"$f":"F3/O3","v":0},{"$f":"I3/N3","v":6.7227342704824907E-3},{"$f":"H3/O3","v":1.4634146341463415E-2},{"$f":"H3/N3","v":2.8811718302067815E-4},{"$f":"H3/P3","v":1.3333333333333334E-2},{"$f":"K3/N3","v":0.34544001736386232},{"$f":"J3/O3","v":0.59512195121951217},{"$f":"K3/N3","v":0.34544001736386232},{"$f":"J3/P3","v":0.54222222222222227},{"$f":"M3/N3","v":0.59587339362665581},{"$f":"L3/O3","v":0.3902439024390244},{"$f":"M3/N3","v":0.59587339362665581},{"$f":"L3/P3","v":0.35555555555555557},null,"Pre-Fund Drive",null,59014,4,42.46,0,0,0,0,72,1289.45,66,7247,8578.91,138,142,60.414859154929573,60.414859154929573,null,0.14537075948080116,4.9493467118783161E-3,2.8985507246376812E-2,4.9493467118783161E-3,2.8985507246376812E-2,0,0,0,0,0,0,0,0,0.1503046424312646,0.52173913043478259,0.1503046424312646,0.50704225352112675,0.84474601085685708,0.47826086956521741,0.84474601085685708,0.46478873239436619,null,"Pre-Fund Drive",null,45128,null,null,0,0,54,4648.8900000000003,68,2228.06,44,5118.37,11995.32,166,166,72.260963855421679,72.260963855421679,null,0.26580659457542988,null,null,null,null,0,0,0,0,0.38755864787267036,0.3253012048192771,4.5017556847170397E-3,0.3253012048192771,0.18574410686834533,0.40963855421686746,0.18574410686834533,0.40963855421686746,0.42669724525898434,0.26506024096385544,0.42669724525898434,0.26506024096385544,null,"Pre-Fund Drive",null,65854,null,null,0,0,21,2460.69,165,3373.7200000000003,66,5705.66,11540.070000000002,252,252,45.79392857142858,45.79392857142858,null,0.17523719136271149,null,null,null,null,0,0,0,0,0.21323007572744357,8.3333333333333329E-2,1.8197463273619656E-3,8.3333333333333329E-2,0.29234831331179101,0.65476190476190477,0.29234831331179101,0.65476190476190477,0.49442161096076531,0.26190476190476192,0.49442161096076531,0.26190476190476192,null,"Pre-Fund Drive",null,76366,null,null,0,0,0,0,88,2170.8199999999997,29,2963.79,5134.6099999999997,117,117,43.885555555555555,43.885555555555555,null,6.7236859335306279E-2,null,null,null,null,0,0,0,0,0,0,0,0,0.42278186658772521,0.75213675213675213,0.42278186658772521,0.75213675213675213,0.57721813341227479,0.24786324786324787,0.57721813341227479,0.24786324786324787]
["Day 1","2021-10-04",52905,{"$f":"COUNTIFS('Sanitized Raw Data'!$H:$H,\">=\"&$B4,'Sanitized Raw Data'!$H:$H,\"<\"&$B5,'Sanitized Raw Data'!$D:$D,\"Matching Grant\")","v":0},{"$f":"SUMIFS('Sanitized Raw Data'!$C:$C,'Sanitized Raw Data'!$H:$H,\">=\"&$B4,'Sanitized Raw Data'!$H:$H,\"<\"&$B5,'Sanitized Raw Data'!$D:$D,\"Matching Grant\")","v":0},{"$f":"COUNTIFS('Sanitized Raw Data'!$H:$H,\">=\"&$B4,'Sanitized Raw Data'!$H:$H,\"<\"&$B5,'Sanitized Raw Data'!$D:$D,\"Cash\")","v":0},{"$f":"SUMIFS('Sanitized Raw Data'!$C:$C,'Sanitized Raw Data'!$H:$H,\">=\"&$B4,'Sanitized Raw Data'!$H:$H,\"<\"&$B5,'Sanitized Raw Data'!$D:$D,\"Cash\")","v":0},{"$f":"COUNTIFS('Sanitized Raw Data'!$H:$H,\">=\"&$B4,'Sanitized Raw Data'!$H:$H,\"<\"&$B5,'Sanitized Raw Data'!$D:$D,\"CC\")","v":87},{"$f":"SUMIFS('Sanitized Raw Data'!$C:$C,'Sanitized Raw Data'!$H:$H,\">=\"&$B4,'Sanitized Raw Data'!$H:$H,\"<\"&$B5,'Sanitized Raw Data'!$D:$D,\"CC\")","v":6723.6599999999989},{"$f":"COUNTIFS('Sanitized Raw Data'!$H:$H,\">=\"&$B4,'Sanitized Raw Data'!$H:$H,\"<\"&$B5,'Sanitized Raw Data'!$D:$D,\"PayPal\")","v":22},{"$f":"SUMIFS('Sanitized Raw Data'!$C:$C,'Sanitized Raw Data'!$H:$H,\">=\"&$B4,'Sanitized Raw Data'!$H:$H,\"<\"&$B5,'Sanitized Raw Data'!$D:$D,\"PayPal\")","v":1120.6799999999998},{"$f":"COUNTIFS('Sanitized Raw Data'!$H:$H,\">=\"&$B4,'Sanitized Raw Data'!$H:$H,\"<\"&$B5,'Sanitized Raw Data'!$D:$D,\"Personal Check\")+COUNTIFS('Sanitized Raw Data'!$H:$H,\">=\"&$B4,'Sanitized Raw Data'!$H:$H,\"<\"&$B5,'Sanitized Raw Data'!$D:$D,\"ACH Grant Deposit\")","v":7},{"$f":"SUMIFS('Sanitized Raw Data'!$C:$C,'Sanitized Raw Data'!$H:$H,\">=\"&$B4,'Sanitized Raw Data'!$H:$H,\"<\"&$B5,'Sanitized Raw Data'!$D:$D,\"Personal Check\")+SUMIFS('Sanitized Raw Data'!$C:$C,'Sanitized Raw Data'!$H:$H,\">=\"&$B4,'Sanitized Raw Data'!$H:$H,\"<\"&$B5,'Sanitized Raw Data'!$D:$D,\"ACH Grant Deposit\")","v":339},{"$f":"SUM(G4,M4,K4,I4,N3,E4)","v":18595.769999999997},{"$f":"SUM(F4,H4,J4,L4,D4)","v":116},{"$f":"SUM(F4,L4,J4,H4,P3,D4)","v":341},{"$f":"N4/P4","v":54.533049853372425},70.5460344827586,{"$f":"N4/Sheet11!$A1","v":18595.769999999997},{"$f":"(N4-N3)/C$3","v":0.15467989793025227},{"$f":"E4/(N4-N3)","v":0},0,{"$f":"SUM(E$3:E4)/N4","v":2.9096402031214632E-2},{"$f":"SUM(D$3:D4)/O4","v":0.17241379310344829},{"$f":"G4/(N4-N3)","v":0},0,{"$f":"SUM(G$3:G4)/N4","v":0},{"$f":"SUM(F$3:F4)/O4","v":0},{"$f":"I4/(N4-N3)","v":0.82162784388770382},{"$f":"H4/O4","v":0.75},{"$f":"SUM(I$3:I4)/N4","v":0.36533362157092714},{"$f":"SUM(H$3:H4)/P4","v":0.26392961876832843},{"$f":"K4/(N4-N3)","v":0.13694652794580212},{"$f":"J4/O4","v":0.18965517241379309},{"$f":"SUM(K$3:K4)/N4","v":0.2536894143130401},{"$f":"SUM(J$3:J4)/P4","v":0.42228739002932553},{"$f":"M4/(N4-N3)","v":4.142562816649438E-2},{"$f":"L4/O4","v":6.0344827586206899E-2},{"$f":"SUM(M$3:M4)/N4","v":0.35188056208481827},{"$f":"SUM(L$3:L4)/P4","v":0.25513196480938416},null,"Day 1","2021-04-04",59014,0,0,0,0,21,1365.58,0,0,0,0,9944.49,21,163,61.009141104294478,65.027619047619041,9944.49,2.3139932897278611E-2,0,0,4.2697011108664201E-3,0.19047619047619047,0,0,0,0,1,1,0.13732026478984843,0.12883435582822086,0,0,0.12966476913345984,0.44171779141104295,0,0,0.72874526496582526,0.40490797546012269,null,"Day 1","2020-11-08",45128,null,null,0,0,36,2252.59,6,320,2,100,14667.91,44,210,69.847190476190477,60.74068181818182,14667.91,5.9222433965608938E-2,null,null,null,null,0,0,0,0,0.84284907149993082,0.81818181818181823,0.47051556765755997,0.42857142857142855,0.1197340407619575,0.13636363636363635,0.17371663720325528,0.35238095238095241,3.741688773811172E-2,4.5454545454545456E-2,0.35576779513918477,0.21904761904761905,null,"Day 1","2020-07-15",65854,null,null,0,0,203,16744.550000000003,9,265,22,1490,30039.620000000003,234,486,61.80991769547326,79.057905982905993,30039.620000000003,0.28091763598262826,null,null,null,null,0,0,0,0,0.90513282755526492,0.86752136752136755,0.63933032441821835,0.46090534979423869,1.4324672762310432E-2,3.8461538461538464E-2,0.12113069339758625,0.35802469135802467,8.054249968242469E-2,9.4017094017094016E-2,0.23953898218419539,0.18106995884773663,null,"Day 1","2019-10-07",76366,null,null,0,0,31,3227.28,11,474,6,569,9404.89,48,165,56.999333333333333,88.964166666666685,9404.89,5.5918602519445824E-2,null,null,null,null,0,0,0,0,0.75575372106747107,0.64583333333333337,0.34314914900652749,0.18787878787878787,0.11099974708918385,0.22916666666666666,0.28121753683456158,0.6,0.13324653184334517,0.125,0.37563331415891099,0.21212121212121213]
["Day 2","2021-10-05",52905,{"$f":"COUNTIFS('Sanitized Raw Data'!$H:$H,\">=\"&$B5,'Sanitized Raw Data'!$H:$H,\"<\"&$B6,'Sanitized Raw Data'!$D:$D,\"Matching Grant\")","v":0},{"$f":"SUMIFS('Sanitized Raw Data'!$C:$C,'Sanitized Raw Data'!$H:$H,\">=\"&$B5,'Sanitized Raw Data'!$H:$H,\"<\"&$B6,'Sanitized Raw Data'!$D:$D,\"Matching Grant\")","v":0},{"$f":"COUNTIFS('Sanitized Raw Data'!$H:$H,\">=\"&$B5,'Sanitized Raw Data'!$H:$H,\"<\"&$B6,'Sanitized Raw Data'!$D:$D,\"Cash\")","v":0},{"$f":"SUMIFS('Sanitized Raw Data'!$C:$C,'Sanitized Raw Data'!$H:$H,\">=\"&$B5,'Sanitized Raw Data'!$H:$H,\"<\"&$B6,'Sanitized Raw Data'!$D:$D,\"Cash\")","v":0},{"$f":"COUNTIFS('Sanitized Raw Data'!$H:$H,\">=\"&$B5,'Sanitized Raw Data'!$H:$H,\"<\"&$B6,'Sanitized Raw Data'!$D:$D,\"CC\")","v":51},{"$f":"SUMIFS('Sanitized Raw Data'!$C:$C,'Sanitized Raw Data'!$H:$H,\">=\"&$B5,'Sanitized Raw Data'!$H:$H,\"<\"&$B6,'Sanitized Raw Data'!$D:$D,\"CC\")","v":4535.3599999999997},{"$f":"COUNTIFS('Sanitized Raw Data'!$H:$H,\">=\"&$B5,'Sanitized Raw Data'!$H:$H,\"<\"&$B6,'Sanitized Raw Data'!$D:$D,\"PayPal\")","v":7},{"$f":"SUMIFS('Sanitized Raw Data'!$C:$C,'Sanitized Raw Data'!$H:$H,\">=\"&$B5,'Sanitized Raw Data'!$H:$H,\"<\"&$B6,'Sanitized Raw Data'!$D:$D,\"PayPal\")","v":1385},{"$f":"COUNTIFS('Sanitized Raw Data'!$H:$H,\">=\"&$B5,'Sanitized Raw Data'!$H:$H,\"<\"&$B6,'Sanitized Raw Data'!$D:$D,\"Personal Check\")+COUNTIFS('Sanitized Raw Data'!$H:$H,\">=\"&$B5,'Sanitized Raw Data'!$H:$H,\"<\"&$B6,'Sanitized Raw Data'!$D:$D,\"ACH Grant Deposit\")","v":8},{"$f":"SUMIFS('Sanitized Raw Data'!$C:$C,'Sanitized Raw Data'!$H:$H,\">=\"&$B5,'Sanitized Raw Data'!$H:$H,\"<\"&$B6,'Sanitized Raw Data'!$D:$D,\"Personal Check\")+SUMIFS('Sanitized Raw Data'!$C:$C,'Sanitized Raw Data'!$H:$H,\">=\"&$B5,'Sanitized Raw Data'!$H:$H,\"<\"&$B6,'Sanitized Raw Data'!$D:$D,\"ACH Grant Deposit\")","v":1110},{"$f":"SUM(G5,M5,K5,I5,N4,E5)","v":25626.129999999997},{"$f":"SUM(F5,H5,J5,L5,D5)","v":66},{"$f":"SUM(F5,L5,J5,H5,P4,D5)","v":407},{"$f":"N5/P5","v":62.963464373464369},{"$f":"(SUM(G5,M5,K5,I5,E5))/(SUM(F5,H5,J5,L5,D5))","v":106.52060606060606},{"$f":"N5/Sheet11!$A2","v":12813.064999999999},{"$f":"(N5-N4)/C$3","v":0.13288649466024005},{"$f":"E5/(N5-N4)","v":0},{"$f":"D5/O5","v":0},{"$f":"SUM(E$3:E5)/N5","v":2.1113995753553116E-2},{"$f":"SUM(D$3:D5)/O5","v":0.30303030303030304},{"$f":"G5/(N5-N4)","v":0},{"$f":"F5/O5","v":0},{"$f":"SUM(G$3:G5)/N5","v":0},{"$f":"SUM(F$3:F5)/O5","v":0},{"$f":"I5/(N5-N4)","v":0.64511063444830696},{"$f":"H5/O5","v":0.77272727272727271},{"$f":"SUM(I$3:I5)/N5","v":0.44208860253186882},{"$f":"SUM(H$3:H5)/P5","v":0.34643734643734642},{"$f":"K5/(N5-N4)","v":0.19700271394352492},{"$f":"J5/O5","v":0.10606060606060606},{"$f":"SUM(K$3:K5)/N5","v":0.2381377913871506},{"$f":"SUM(J$3:J5)/P5","v":0.37100737100737102},{"$f":"M5/(N5-N4)","v":0.15788665160816798},{"$f":"L5/O5","v":0.12121212121212122},{"$f":"SUM(M$3:M5)/N5","v":0.29865961032742755},{"$f":"SUM(L$3:L5)/P5","v":0.2334152334152334},null,"Day 2","2021-04-05",59014,0,0,0,0,130,9679.0500000000011,42,2174.4700000000003,27,1885.79,23683.800000000003,199,362,65.424861878453044,69.041758793969862,11841.900000000001,0.23281441691801952,0,0,1.7927866305238178E-3,2.0100502512562814E-2,0,0,0,0,0.70447860918779759,0.65326633165829151,0.46633690539524908,0.41712707182320441,0.15826631759527951,0.21105527638190955,0.14625693512020874,0.31491712707182318,0.13725507321692279,0.135678391959799,0.38561337285401837,0.25690607734806631,null,"Day 2","2020-11-09",45128,null,null,0,0,100,6744.75,20,1199.47,11,520,23132.129999999997,131,341,67.836158357771254,64.612366412213731,11566.064999999999,0.18756027300124087,null,null,null,null,0,0,0,0,0.79685428781388035,0.76335877862595425,0.58992535490678988,0.55718475073313778,0.14171063606569778,0.15267175572519084,0.16200540114550627,0.2756598240469208,6.1435076120422219E-2,8.3969465648854963E-2,0.24806924394770394,0.16715542521994134,null,"Day 2","2020-07-16",65854,null,null,0,0,47,3898.15,4,330,11,970,35237.770000000004,62,548,64.302500000000009,83.841129032258053,17618.885000000002,7.8934461080572199E-2,null,null,null,null,0,0,0,0,0.74991102603810955,0.75806451612903225,0.65564279464903708,0.49452554744525545,6.3484124159556746E-2,6.4516129032258063E-2,0.11262687735347611,0.32481751824817517,0.18660484980233347,0.17741935483870969,0.23173032799748675,0.18065693430656934,null,"Day 2","2019-10-08",76366,null,null,0,0,71,4453.26,17,739.68000000000006,14,957,15554.83,102,267,58.257790262172286,60.293529411764709,7777.415,8.053243590079355E-2,null,null,null,null,0,0,0,0,0.72411438160372299,0.69607843137254899,0.49377203093830024,0.38202247191011235,0.12027434413994283,0.16666666666666666,0.21758514879301155,0.43445692883895132,0.1556112742563342,0.13725490196078433,0.28864282026868826,0.18352059925093633]
["Day 3","2021-10-06",52905,{"$f":"COUNTIFS('Sanitized Raw Data'!$H:$H,\">=\"&$B6,'Sanitized Raw Data'!$H:$H,\"<\"&$B7,'Sanitized Raw Data'!$D:$D,\"Matching Grant\")","v":0},{"$f":"SUMIFS('Sanitized Raw Data'!$C:$C,'Sanitized Raw Data'!$H:$H,\">=\"&$B6,'Sanitized Raw Data'!$H:$H,\"<\"&$B7,'Sanitized Raw Data'!$D:$D,\"Matching Grant\")","v":0},{"$f":"COUNTIFS('Sanitized Raw Data'!$H:$H,\">=\"&$B6,'Sanitized Raw Data'!$H:$H,\"<\"&$B7,'Sanitized Raw Data'!$D:$D,\"Cash\")","v":0},{"$f":"SUMIFS('Sanitized Raw Data'!$C:$C,'Sanitized Raw Data'!$H:$H,\">=\"&$B6,'Sanitized Raw Data'!$H:$H,\"<\"&$B7,'Sanitized Raw Data'!$D:$D,\"Cash\")","v":0},{"$f":"COUNTIFS('Sanitized Raw Data'!$H:$H,\">=\"&$B6,'Sanitized Raw Data'!$H:$H,\"<\"&$B7,'Sanitized Raw Data'!$D:$D,\"CC\")","v":19},{"$f":"SUMIFS('Sanitized Raw Data'!$C:$C,'Sanitized Raw Data'!$H:$H,\">=\"&$B6,'Sanitized Raw Data'!$H:$H,\"<\"&$B7,'Sanitized Raw Data'!$D:$D,\"CC\")","v":1680},{"$f":"COUNTIFS('Sanitized Raw Data'!$H:$H,\">=\"&$B6,'Sanitized Raw Data'!$H:$H,\"<\"&$B7,'Sanitized Raw Data'!$D:$D,\"PayPal\")","v":5},{"$f":"SUMIFS('Sanitized Raw Data'!$C:$C,'Sanitized Raw Data'!$H:$H,\">=\"&$B6,'Sanitized Raw Data'!$H:$H,\"<\"&$B7,'Sanitized Raw Data'!$D:$D,\"PayPal\")","v":230},{"$f":"COUNTIFS('Sanitized Raw Data'!$H:$H,\">=\"&$B6,'Sanitized Raw Data'!$H:$H,\"<\"&$B7,'Sanitized Raw Data'!$D:$D,\"Personal Check\")+COUNTIFS('Sanitized Raw Data'!$H:$H,\">=\"&$B6,'Sanitized Raw Data'!$H:$H,\"<\"&$B7,'Sanitized Raw Data'!$D:$D,\"ACH Grant Deposit\")","v":4},{"$f":"SUMIFS('Sanitized Raw Data'!$C:$C,'Sanitized Raw Data'!$H:$H,\">=\"&$B6,'Sanitized Raw Data'!$H:$H,\"<\"&$B7,'Sanitized Raw Data'!$D:$D,\"Personal Check\")+SUMIFS('Sanitized Raw Data'!$C:$C,'Sanitized Raw Data'!$H:$H,\">=\"&$B6,'Sanitized Raw Data'!$H:$H,\"<\"&$B7,'Sanitized Raw Data'!$D:$D,\"ACH Grant Deposit\")","v":389},{"$f":"SUM(G6,M6,K6,I6,N5,E6)","v":27925.129999999997},{"$f":"SUM(F6,H6,J6,L6,D6)","v":28},{"$f":"SUM(F6,L6,J6,H6,P5,D6)","v":435},{"$f":"N6/P6","v":64.195701149425275},{"$f":"(SUM(G6,M6,K6,I6,E6))/(SUM(F6,H6,J6,L6,D6))","v":82.107142857142861},{"$f":"N6/Sheet11!$A3","v":9308.3766666666652},{"$f":"(N6-N5)/C$3","v":4.3455249976372741E-2},{"$f":"E6/(N6-N5)","v":0},{"$f":"D6/O6","v":0},{"$f":"SUM(E$3:E6)/N6","v":1.9375737910620295E-2},{"$f":"SUM(D$3:D6)/O6","v":0.7142857142857143},{"$f":"G6/(N6-N5)","v":0},{"$f":"F6/O6","v":0},{"$f":"SUM(G$3:G6)/N6","v":0},{"$f":"SUM(F$3:F6)/O6","v":0},{"$f":"I6/(N6-N5)","v":0.73075250108742928},{"$f":"H6/O6","v":0.6785714285714286},{"$f":"SUM(I$3:I6)/N6","v":0.46585351616984416},{"$f":"SUM(H$3:H6)/P6","v":0.36781609195402298},{"$f":"K6/(N6-N5)","v":0.10004349717268378},{"$f":"J6/O6","v":0.17857142857142858},{"$f":"SUM(K$3:K6)/N6","v":0.2267688637438752},{"$f":"SUM(J$3:J6)/P6","v":0.35862068965517241},{"$f":"M6/(N6-N5)","v":0.16920400173988689},{"$f":"L6/O6","v":0.14285714285714285},{"$f":"SUM(M$3:M6)/N6","v":0.28800188217566042},{"$f":"SUM(L$3:L6)/P6","v":0.22758620689655173},null,"Day 3","2021-04-06",59014,0,0,0,0,33,3646.3,10,1038.79,3,264,28632.890000000003,46,408,70.178651960784322,107.58891304347826,9544.2966666666671,8.3862981665367542E-2,0,0,1.4829100380716021E-3,8.6956521739130432E-2,0,0,0,0,0.73676170770788163,0.71739130434782605,0.51307884045236085,0.45098039215686275,0.20989515244216611,0.21739130434782608,0.15725656753474762,0.30392156862745096,5.3343139849952211E-2,6.5217391304347824E-2,0.32818168197481984,0.23529411764705882,null,"Day 3","2020-11-10",45128,null,null,0,0,18,1087.6799999999998,4,150,8,584,24953.809999999998,30,371,67.260943396226409,60.722666666666662,8317.9366666666665,4.036695621343734E-2,null,null,null,null,0,0,0,0,0.59707522726274631,0.6,0.59044731045078891,0.56064690026954178,8.2341574810065418E-2,0.13333333333333333,0.1561897762305636,0.26415094339622641,0.32058319792718803,0.26666666666666666,0.25336291331864758,0.17520215633423181,null,"Day 3","2020-07-17",65854,null,null,0,0,28,2220,0,0,5,489,37946.770000000004,33,581,65.312857142857155,82.090909090909093,12648.923333333334,4.1136453366538102E-2,null,null,null,null,0,0,0,0,0.81949058693244736,0.84848484848484851,0.66733980257081171,0.51462994836488818,0,0,0.10458650367343518,0.30636833046471601,0.18050941306755261,0.15151515151515152,0.22807369375575309,0.17900172117039587,null,"Day 3","2019-10-09",76366,null,null,0,0,17,1729,3,99.789999999999992,8,331,17714.62,28,295,60.049559322033893,77.135357142857146,5904.873333333333,2.828208888772489E-2,null,null,null,null,0,0,0,0,0.8005407933178692,0.6071428571428571,0.53117368591592717,0.4033898305084746,4.6203566087443707E-2,0.10714285714285714,0.19669007859045243,0.4033898305084746,0.15325564059468752,0.2857142857142857,0.27213623549362054,0.19322033898305085]
{"$rows_left_out":42}
{"sheet":"Sanitized Raw Data","index":6,"n_rows":774,"n_cols":12,"rows_kept":774,"cut":false,"hidden":false,"merged":[]}
["donate_id","donate_invoice","donate_amount","donate_method","donate_affiliation","donate_classyear","donate_isthanked","donate_transac_date","donate_create_date","donate_mod_date","donate_num_recurring","donate_pledge"]
[56425,"EF50-000001",25,"PayPal",1,1965,"N","2021-04-17","2021-04-19T11:58:01","2021-04-19T11:58:01",1,"None. Donation by check."]
[56426,"EF50-000002",50,"PayPal",1,1964,"N","2021-04-17","2021-04-19T11:59:13","2021-04-19T11:59:13",1,"None. Donation by check."]
[56427,"EF50-000003",200,"PayPal",1,1980,"N","2021-04-18","2021-04-19T12:01:05","2021-04-19T12:01:05",1,"None. Donation by check."]
[56428,"EF50-000004",100,"PayPal",1,1979,"N","2021-04-18","2021-04-19T12:02:20","2021-04-19T12:02:20",1,"None. Donation by check."]
[56429,"EF50-000005",25,"PayPal",1,1992,"N","2021-04-18","2021-04-19T12:03:45","2021-04-19T12:03:45",1,"None. Donation by check."]
{"$rows_left_out":769}
{"sheet":"Sheet11","index":7,"n_rows":62,"n_cols":1,"rows_kept":62,"cut":false,"hidden":true,"merged":[]}
[1]
[2]
[3]
[4]
[5]
[6]
{"$rows_left_out":56}